{"text_format":"1","workbook":"xlsx","n_sheets":7,"sheets":["Order_Entry","Order_Sheet","Database","2.5_Angle","2.5_Straight","1.5_Angle","Flow_Charts"],"not_rendered":{"charts":13,"images":3,"macros":1,"external_links":0,"defined_names":19,"comments":0,"pivot_tables":0},"unopened":[],"bounds":{"document_bytes":16777216,"sheet_cells":100000,"rows_first":2000,"rows_last":500,"rows_between":2000,"halvings":0,"cell_chars":16384,"cell_head_chars":4096},"cells_cut":0,"cells_raw":0,"read":"whole","date_system":"1900"}

{"sheet":"Order_Entry","index":0,"n_rows":45,"n_cols":13,"rows_kept":45,"cut":false,"hidden":false,"merged":[[31,1,31,2],[31,3,31,4],[15,2,15,3],[16,2,16,3],[29,1,29,2],[30,1,30,2],[27,3,27,4],[28,3,28,4],[29,3,29,4],[30,3,30,4],[27,1,27,2],[28,1,28,2]]}
[]
[]
[]
[]
[]
[]
[]
[]
[]
[]
[]
[]
[]
[null,"Information"]
[]
{"$rows_left_out":31}
{"sheet":"Order_Sheet","index":1,"n_rows":2,"n_cols":15,"rows_kept":2,"cut":false,"hidden":false,"merged":[[0,0,0,1],[0,11,0,13],[0,2,0,4]]}
["Project Name:",null,{"$f":" IF(Order_Entry!C16=\"\",\"\",Order_Entry!C16)","v":""},null,null,null,null,null,null,null,"Date:",{"$f":"Order_Entry!$C$17","v":"2015-09-28"}]
["Order Quantity","Body Style","Type","Inlet Connection","Outlet Connection","Monitoring Switch","Location Tag",null,"Static Inlet [PSI]","Residual Inlet [PSI]","Flow Rate [GPM]","Desired Outlet Residual [PSI]",null,"Static Outlet [PSI]","Residual Outlet [PSI]"]

{"sheet":"Database","index":2,"n_rows":55,"n_cols":14,"rows_kept":55,"cut":false,"hidden":true,"merged":[]}
["Variables"]
["Static Inlet Pressure [psig]:",{"$f":"Order_Entry!$D$28","v":0},null,"Minimum Flow Rate [GPM]:",{"$f":"VLOOKUP(Order_Entry!E23,D36:I37,6)","v":{"$error":"#N/A"}}]
["Residual Inlet Pressure [psig]:",{"$f":"Order_Entry!$D$29","v":0},null,"Maximum Flow Rate [GPM]:",{"$f":"VLOOKUP(Main,B36:H38,7)","v":500}]
["Flow Rate [GPM]:",{"$f":"Order_Entry!$D$30","v":0},null,"Minimum Inlet Pressure [psig]:",50]
["Desired Residual Outlet Pressure [psig]:",{"$f":"Order_Entry!$D$31","v":0}]
[]
[]
["Calculation Tables"]
[null,"Configuration","Valve Type","Max Inlet Rating","Max Flow Rating","Calculated Static Out.Pressure","Calculated Res. Out. Pressure","Static Out. Status","Res. Out Status","Flow Status","Static Out. Display","Res. Out. Display","Difference to Desired Residual Outlet Pressure","Status"]
[null,"1.5\" Angle","Type 1",{"$f":"'1.5_Angle'!$A$9","v":210},{"$f":"'1.5_Angle'!$AI$13","v":250},{"$f":"'1.5_Angle'!$AG$13","v":{"$error":"#NUM!"}},{"$f":"'1.5_Angle'!$AH$13","v":{"$error":"#NUM!"}},{"$f":"IF($B$2<$E$4,$B$51, IF($B$2>$D10, $B$50, $B$47))","v":"Err2"},{"$f":"IF($B$3<$E$4,$B$53,IF($B$3>$D10,$B$52,$B$48))","v":"Err4"},{"$f":"IF($B$4<$E$2,$B$55,IF($B$4>$E10,$B$54,$B$49))","v":{"$error":"#N/A"}},{"$f":"IF(AND($H10=\"SC\",$I10=\"RC\",$J10=\"FC\"), $F10, \"N/A\")","v":{"$error":"#N/A"}},{"$f":"IF(AND($H10=\"SC\",$I10=\"RC\",$J10=\"FC\"), $G10, \"N/A\")","v":{"$error":"#N/A"}},{"$f":"IF(AND(H10=\"SC\",I10=\"RC\",J10=\"FC\",$B$5>0),(ABS($B$5-$L10)),\"-\")","v":{"$error":"#N/A"}},{"$f":"IF(AND($H10=\"SC\",$I10=\"RC\",$J10=\"FC\"), \"Available\", \"Unavailable\")","v":{"$error":"#N/A"}}]
[null,"1.5\" Angle","Type 2",{"$f":"'1.5_Angle'!$A$17","v":250},{"$f":"'1.5_Angle'!$AI$14","v":250},{"$f":"'1.5_Angle'!$AG$14","v":{"$error":"#NUM!"}},{"$f":"'1.5_Angle'!$AH$14","v":{"$error":"#NUM!"}},{"$f":"IF($B$2<$E$4,$B$51, IF($B$2>$D11, $B$50, $B$47))","v":"Err2"},{"$f":"IF($B$3<$E$4,$B$53,IF($B$3>$D11,$B$52,$B$48))","v":"Err4"},{"$error":"#N/A"},{"$error":"#N/A"},{"$error":"#N/A"},{"$error":"#N/A"},{"$error":"#N/A"}]
[null,"1.5\" Angle","Type 3",{"$f":"'1.5_Angle'!$A$26","v":260},{"$f":"'1.5_Angle'!$AI$15","v":250},{"$f":"'1.5_Angle'!$AG$15","v":{"$error":"#NUM!"}},{"$f":"'1.5_Angle'!$AH$15","v":{"$error":"#NUM!"}},{"$f":"IF($B$2<$E$4,$B$51, IF($B$2>$D12, $B$50, $B$47))","v":"Err2"},"Err4",{"$error":"#N/A"},{"$error":"#N/A"},{"$error":"#N/A"},{"$error":"#N/A"},{"$error":"#N/A"}]
[null,"1.5\" Angle","Type 4A",{"$f":"'1.5_Angle'!$A$44","v":260},{"$f":"'1.5_Angle'!$AI$17","v":250},{"$f":"'1.5_Angle'!$AG$17","v":{"$error":"#NUM!"}},{"$f":"'1.5_Angle'!$AH$17","v":{"$error":"#NUM!"}},{"$f":"IF($B$2<E7,$B$51, IF($B$2>Table3[[#This Row],[Max Inlet Rating]], $B$50, $B$47))","v":"SC"},"Err4",{"$error":"#N/A"},{"$error":"#N/A"},{"$error":"#N/A"},{"$error":"#N/A"},{"$error":"#N/A"}]
[null,"1.5\" Angle","Type 4B",{"$f":"'1.5_Angle'!$A$35","v":275},{"$f":"'1.5_Angle'!$AI$16","v":200},{"$f":"'1.5_Angle'!$AG$16","v":{"$error":"#NUM!"}},{"$f":"'1.5_Angle'!$AH$16","v":{"$error":"#NUM!"}},{"$f":"IF($B$2<$E$4,$B$51, IF($B$2>$D14, $B$50, $B$47))","v":"Err2"},"Err4",{"$error":"#N/A"},{"$error":"#N/A"},{"$error":"#N/A"},{"$error":"#N/A"},{"$error":"#N/A"}]
[null,"1.5\" Angle","Type 5",{"$f":"'1.5_Angle'!$A$54","v":300},{"$f":"'1.5_Angle'!$AI$18","v":250},{"$f":"'1.5_Angle'!$AG$18","v":{"$error":"#NUM!"}},{"$f":"'1.5_Angle'!$AH$18","v":{"$error":"#NUM!"}},"Err2","Err4",{"$error":"#N/A"},{"$error":"#N/A"},{"$error":"#N/A"},{"$error":"#N/A"},{"$error":"#N/A"}]
{"$rows_left_out":41}
{"sheet":"2.5_Angle","index":3,"n_rows":75,"n_cols":37,"rows_kept":75,"cut":false,"hidden":true,"merged":[[11,28,11,29],[54,1,54,12],[65,1,65,12],[2,1,2,12],[10,1,10,12],[18,1,18,12],[26,1,26,12],[35,1,35,12],[44,1,44,12],[2,15,2,20],[10,15,10,20],[18,15,18,20],[26,15,26,20],[35,15,35,20],[46,14,50,14],[56,14,60,14],[67,14,71,14],[44,15,44,20],[54,15,54,20],[65,15,65,20],[4,14,8,14],[12,14,16,14],[20,14,24,14],[28,14,32,14],[37,14,41,14],[66,28,66,29],[67,22,71,22],[3,33,3,35],[55,28,55,29],[56,22,60,22],[37,22,41,22],[45,28,45,29],[46,22,50,22],[27,28,27,29],[28,22,32,22],[36,28,36,29],[19,28,19,29],[20,22,24,22],[4,22,8,22],[12,22,16,22],[3,28,3,29]]}
["2.5\" Angle Body - Outlet Pressures @ Flow Rate"]
["Data compiled from Project No. 12CA5765 - EX5549. Published 13-Nov-2013. Values with blank data indicate pumps were unable to meet required specifications."]
["Type 0","Outlet Pressures: Inlet Pressure [psig] vs. Flow Rate [GPM]",null,null,null,null,null,null,null,null,null,null,null,null,"Type 0","Inlet vs. Outlet Pressure Over Flow Range",null,null,null,null,null,null,"Type 0"]
["Inlet Pressure (psig)",0,50,75,100,150,200,250,300,350,400,450,500,null,null,null,"Static","50-200 [GPM]","200-300 [GPM]","300-400 [GPM]","400-500 [GPM]",null,null,null,{"$f":"CONCATENATE(\"Outlet Residual @ \" &AJ$8& \" GPM\")","v":"Outlet Residual @ 0 GPM"},{"$f":"CONCATENATE(\"Outlet Residual @ \" &AJ$9& \" GPM\")","v":"Outlet Residual @ 0 GPM"},null,null,"Const. PRI Interpolated @ Var. Flow",null,null,null,null,"Variables:"]
[50,41,38,40,36,36,35,37,34,30,28,26,null,null,"Inlet Pressure (psig)",{"$f":"A5","v":50},{"$f":"B5","v":41},{"$f":"AVERAGE(C5:G5)","v":37},{"$f":"AVERAGE(G5:I5)","v":35.333333333333336},{"$f":"AVERAGE(I5:K5)","v":30.666666666666668},{"$f":"AVERAGE(K5:M5)","v":27},null,"Inlet Pressure (psig)",{"$f":"A5","v":50},{"$f":"HLOOKUP($AJ$8,$B$4:$M$9,2)","v":41},{"$f":"HLOOKUP($AJ$9,$B$4:$M$9,2)","v":41},"PRI1:",{"$f":"LARGE(A5:A9,COUNTIF(A5:A9,\">\" &AJ6)+1)","v":{"$error":"#NUM!"}},{"$f":"VLOOKUP(AB5,X5:Z9,2)","v":{"$error":"#NUM!"}},{"$f":"VLOOKUP(AB5,X5:Z9,3)","v":{"$error":"#NUM!"}},"PRO1:",{"$f":"IF(AJ8=AJ9, AC5, FORECAST(AJ7,$AC$5:$AD$5,$AJ$8:$AJ$9))","v":{"$error":"#NUM!"}},null,"Static Inlet Pressure ","PSI:",{"$f":"Database!$B$2","v":0}]
[100,80,79,78,78,77,76,75,74,72,68,65,64,null,null,{"$f":"A6","v":100},{"$f":"B6","v":80},{"$f":"AVERAGE(C6:G6)","v":77.599999999999994},{"$f":"AVERAGE(G6:I6)","v":75},{"$f":"AVERAGE(I6:K6)","v":71.333333333333329},{"$f":"AVERAGE(K6:M6)","v":65.666666666666671},null,null,{"$f":"A6","v":100},{"$f":"HLOOKUP($AJ$8,$B$4:$M$9,3)","v":80},{"$f":"HLOOKUP($AJ$9,$B$4:$M$9,3)","v":80},"PRI2:",{"$f":"SMALL(A5:A9,COUNTIF(A5:A9,\"<\"&AJ6)+1)","v":50},{"$f":"VLOOKUP(AB6,X5:Z9,2)","v":41},{"$f":"VLOOKUP(AB6,X5:Z9,3)","v":41},"PRO2:",{"$f":"IF(AJ8=AJ9, AC6, FORECAST($AJ$7,$AC$6:$AD$6,$AJ$8:$AJ$9))","v":41},null,"Residual Inlet Pressure ","PRI:",{"$f":"Database!$B$3","v":0}]
[150,121,118,117,117,116,117,116,114,112,109,106,103,null,null,{"$f":"A7","v":150},121,{"$f":"AVERAGE(C7:G7)","v":117},115.66666666666667,111.66666666666667,106,null,null,{"$f":"A7","v":150},{"$f":"HLOOKUP($AJ$8,$B$4:$M$9,4)","v":121},{"$f":"HLOOKUP($AJ$9,$B$4:$M$9,4)","v":121},"PSI1:",{"$f":"LARGE(A5:A9,COUNTIF(A5:A9,\">\" &AJ5)+1)","v":{"$error":"#NUM!"}},null,null,"PSO1:",{"$f":"VLOOKUP(AB7,A5:B9,2)","v":{"$error":"#NUM!"}},null,"Flow Rate ","Q0:",{"$f":"IF(Database!$B$4=500, 499.99, Database!$B$4)","v":0}]
[200,162,160,158,158,156,156,155,153,152,151,151,144,null,null,{"$f":"A8","v":200},162,157.6,154.66666666666666,152,148.66666666666666,null,null,{"$f":"A8","v":200},{"$f":"HLOOKUP($AJ$8,$B$4:$M$9,5)","v":162},{"$f":"HLOOKUP($AJ$9,$B$4:$M$9,5)","v":162},"PSI2:",{"$f":"SMALL(A5:A9,COUNTIF(A5:A9,\"<\"&AJ5)+1)","v":50},null,null,"PSO2:",{"$f":"VLOOKUP(AB8,A5:B9,2)","v":41},null,"Nearest Known Flow Rate, 1","Q1:",{"$f":"LARGE(B4:M4,COUNTIF(B4:M4,\">\" &AJ7)+1)","v":0}]
[210,172,168,167,166,164,163,163,161,161,158,155,152,null,null,{"$f":"A9","v":210},172,165.6,162.33333333333334,160,155,null,null,{"$f":"A9","v":210},{"$f":"HLOOKUP($AJ$8,$B$4:$M$9,6)","v":172},{"$f":"HLOOKUP($AJ$9,$B$4:$M$9,6)","v":172},null,null,null,null,null,null,null,"Nearest Known Flow Rate, 2","Q2:",{"$f":"SMALL(B4:M4,COUNTIF(B4:M4,\"<\"&AJ7)+1)","v":0}]
[]
["Type 1","Outlet Pressures: Inlet Pressure [psig] vs. Flow Rate [GPM]",null,null,null,null,null,null,null,null,null,null,null,null,"Type 1","Inlet vs. Outlet Pressure Over Flow Range",null,null,null,null,null,null,"Type 1"]
["Inlet Pressure (psig)",0,50,75,100,150,200,250,300,350,400,450,500,null,null,null,"Static","50-200 [GPM]","200-300 [GPM]","300-400 [GPM]","400-500 [GPM]",null,null,null,{"$f":"CONCATENATE(\"Outlet Residual @ \" &AJ$8& \" GPM\")","v":"Outlet Residual @ 0 GPM"},{"$f":"CONCATENATE(\"Outlet Residual @ \" &AJ$9& \" GPM\")","v":"Outlet Residual @ 0 GPM"},null,null,"Const. PRI Interpolated @ Var. Flow"]
[50,36,35,35,34,34,34,32,29,null,null,null,null,null,"Inlet Pressure (psig)",{"$f":"A13","v":50},{"$f":"B13","v":36},{"$f":"AVERAGE(C13:G13)","v":34.4},{"$f":"AVERAGE(G13:I13)","v":31.666666666666668},{"$f":"AVERAGE(I13:K13)","v":29},null,null,"Inlet Pressure (psig)",{"$f":"A13","v":50},{"$f":"HLOOKUP($AJ$8,$B$12:$M$17,2)","v":36},{"$f":"HLOOKUP($AJ$9,$B$12:$M$17,2)","v":36},"PRI1:",{"$f":"LARGE(A13:A17,COUNTIF(A13:A17,\">\" &$AJ$6)+1)","v":{"$error":"#NUM!"}},{"$f":"VLOOKUP(AB13,X13:Z17,2)","v":{"$error":"#NUM!"}},{"$f":"VLOOKUP(AB13,X13:Z17,3)","v":{"$error":"#NUM!"}},"PRO1:",{"$f":"IF(AC13=AD13,AC13, FORECAST($AJ$7,AC13:AD13,$AJ$8:$AJ$9))","v":{"$error":"#NUM!"}}]
[100,75,69,70,71,71,66,67,66,63,60,57,53,null,null,{"$f":"A14","v":100},{"$f":"B14","v":75},{"$f":"AVERAGE(C14:G14)","v":69.400000000000006},{"$f":"AVERAGE(G14:I14)","v":66.333333333333329},{"$f":"AVERAGE(I14:K14)","v":63},{"$f":"AVERAGE(K14:M14)","v":56.666666666666664},null,null,{"$f":"A14","v":100},{"$f":"HLOOKUP($AJ$8,$B$12:$M$17,3)","v":75},{"$f":"HLOOKUP($AJ$9,$B$12:$M$17,3)","v":75},"PRI2:",{"$f":"SMALL(A13:A17,COUNTIF(A13:A17,\"<\"&$AJ$6)+1)","v":50},{"$f":"VLOOKUP(AB14,X13:Z17,2)","v":36},{"$f":"VLOOKUP(AB14,X13:Z17,3)","v":36},"PRO2:",{"$f":"IF(AC14=AD14, AC14, FORECAST($AJ$7,AC14:AD14,$AJ$8:$AJ$9))","v":36}]
[150,114,105,105,106,106,105,105,102,100,98,94,90,null,null,{"$f":"A15","v":150},114,{"$f":"AVERAGE(C15:G15)","v":105.4},104,100,94,null,null,{"$f":"A15","v":150},{"$f":"HLOOKUP($AJ$8,$B$12:$M$17,4)","v":114},{"$f":"HLOOKUP($AJ$9,$B$12:$M$17,4)","v":114},"PSI1:",{"$f":"LARGE(A13:A17,COUNTIF(A13:A17,\">\" &$AJ$5)+1)","v":{"$error":"#NUM!"}},null,null,"PSO1:",{"$f":"VLOOKUP(AB15,A13:B17,2)","v":{"$error":"#NUM!"}}]
{"$rows_left_out":61}
{"sheet":"2.5_Straight","index":4,"n_rows":75,"n_cols":37,"rows_kept":75,"cut":false,"hidden":true,"merged":[[2,15,2,20],[54,1,54,12],[65,1,65,12],[2,1,2,12],[10,1,10,12],[18,1,18,12],[26,1,26,12],[35,1,35,12],[44,1,44,12],[12,14,16,14],[20,14,24,14],[10,15,10,20],[18,15,18,20],[4,14,8,14],[28,14,32,14],[37,14,41,14],[67,14,71,14],[54,15,54,20],[65,15,65,20],[26,15,26,20],[35,15,35,20],[44,15,44,20],[46,14,50,14],[56,14,60,14],[3,28,3,29],[3,33,3,35],[4,22,8,22],[11,28,11,29],[12,22,16,22],[19,28,19,29],[20,22,24,22],[27,28,27,29],[28,22,32,22],[36,28,36,29],[66,28,66,29],[67,22,71,22],[37,22,41,22],[45,28,45,29],[46,22,50,22],[55,28,55,29],[56,22,60,22]]}
["2.5\" Straight Body - Outlet Pressures @ Flow Rate"]
["Data compiled from Project No. 12CA5765 - EX5549. Published 13-Nov-2013. Values with blank data indicate pumps were unable to meet required specifications."]
["Type 0","Outlet Pressures @ Flow Rate, GPM",null,null,null,null,null,null,null,null,null,null,null,null,"Type 0","Inlet vs. Outlet Pressure Over Flow Range",null,null,null,null,null,null,"Type 0"]
["Inlet Pressure (psig)",0,50,100,150,175,200,250,300,350,400,450,500,null,null,null,"Static","50-200 [GPM]","200-300 [GPM]","300-400 [GPM]","400-500 [GPM]",null,null,null,{"$f":"CONCATENATE(\"Outlet Residual @ \" &AJ$8& \" GPM\")","v":"Outlet Residual @ 0 GPM"},{"$f":"CONCATENATE(\"Outlet Residual @ \" &AJ$9& \" GPM\")","v":"Outlet Residual @ 0 GPM"},null,null,"Const. PRI Interpolated @ Var. Flow",null,null,null,null,"Variables:"]
[50,41,35,36,29,26,23,16,null,null,null,null,null,null,"Inlet Pressure (psig)",{"$f":"A5","v":50},{"$f":"B5","v":41},{"$f":"AVERAGE(C5:G5)","v":29.8},{"$f":"AVERAGE(G5:I5)","v":19.5},null,null,null,"Inlet Pressure (psig)",{"$f":"A5","v":50},{"$f":"HLOOKUP($AJ$8,$B$4:$M$9,2)","v":41},{"$f":"HLOOKUP($AJ$9,$B$4:$M$9,2)","v":41},"PRI1:",{"$f":"LARGE(A5:A9,COUNTIF(A5:A9,\">\" &$AJ$6)+1)","v":{"$error":"#NUM!"}},{"$f":"VLOOKUP(AB5,X5:Z9,2)","v":{"$error":"#NUM!"}},{"$f":"VLOOKUP(AB5,X5:Z9,3)","v":{"$error":"#NUM!"}},"PRO1:",{"$f":"IF(AJ8=AJ9, AC5, FORECAST(AJ7,$AC$5:$AD$5,$AJ$8:$AJ$9))","v":{"$error":"#NUM!"}},null,"Static Inlet Pressure","PSI:",{"$f":"Database!$B$2","v":0}]
[100,83,74,69,68,68,63,55,46,36,22,null,null,null,null,{"$f":"A6","v":100},{"$f":"B6","v":83},{"$f":"AVERAGE(C6:G6)","v":68.400000000000006},{"$f":"AVERAGE(G6:I6)","v":54.666666666666664},{"$f":"AVERAGE(I6:K6)","v":34.666666666666664},{"$f":"AVERAGE(K6:M6)","v":22},null,null,{"$f":"A6","v":100},{"$f":"HLOOKUP($AJ$8,$B$4:$M$9,3)","v":83},{"$f":"HLOOKUP($AJ$9,$B$4:$M$9,3)","v":83},"PRI2:",{"$f":"SMALL(A5:A9,COUNTIF(A5:A9,\"<\"&$AJ$6)+1)","v":50},{"$f":"VLOOKUP(AB6,X5:Z9,2)","v":41},{"$f":"VLOOKUP(AB6,X5:Z9,3)","v":41},"PRO2:",{"$f":"IF(AJ8=AJ9, AC6, FORECAST($AJ$7,$AC$6:$AD$6,$AJ$8:$AJ$9))","v":41},null,"Residual Inlet Pressure ","PRI:",{"$f":"Database!$B$3","v":0}]
[150,122,114,106,105,105,105,99,86,74,64,45,null,null,null,{"$f":"A7","v":150},122,{"$f":"AVERAGE(C7:G7)","v":107},96.666666666666671,74.666666666666671,{"$f":"AVERAGE(K7:M7)","v":54.5},null,null,{"$f":"A7","v":150},{"$f":"HLOOKUP($AJ$8,$B$4:$M$9,4)","v":122},{"$f":"HLOOKUP($AJ$9,$B$4:$M$9,4)","v":122},"PSI1:",{"$f":"LARGE(A5:A9,COUNTIF(A5:A9,\">\" &$AJ$5)+1)","v":{"$error":"#NUM!"}},null,null,"PSO1:",{"$f":"VLOOKUP(AB7,A5:B9,2)","v":{"$error":"#NUM!"}},null,"Flow Rate","Q0:",{"$f":"IF(Database!$B$4=500, 499.99, Database!$B$4)","v":0}]
[200,164,149,143,139,138,140,132,123,113,98,88,76,null,null,{"$f":"A8","v":200},164,141.80000000000001,131.66666666666666,111.33333333333333,{"$f":"AVERAGE(K8:M8)","v":87.333333333333329},null,null,{"$f":"A8","v":200},{"$f":"HLOOKUP($AJ$8,$B$4:$M$9,5)","v":164},{"$f":"HLOOKUP($AJ$9,$B$4:$M$9,5)","v":164},"PSI2:",{"$f":"SMALL(A5:A9,COUNTIF(A5:A9,\"<\"&$AJ$5)+1)","v":50},null,null,"PSO2:",{"$f":"VLOOKUP(AB8,A5:B9,2)","v":41},null,"Nearest Known Flow Rate, 1","Q1:",{"$f":"LARGE(B4:M4,COUNTIF(B4:M4,\">\" &AJ7)+1)","v":0}]
[210,171,157,150,147,148,150,142,131,120,107,94,80,null,null,{"$f":"A9","v":210},171,150.4,141,119.33333333333333,{"$f":"AVERAGE(K9:M9)","v":93.666666666666671},null,null,{"$f":"A9","v":210},{"$f":"HLOOKUP($AJ$8,$B$4:$M$9,6)","v":171},{"$f":"HLOOKUP($AJ$9,$B$4:$M$9,6)","v":171},null,null,null,null,null,null,null,"Nearest Known Flow Rate, 2","Q2:",{"$f":"SMALL(B4:M4,COUNTIF(B4:M4,\"<\"&AJ7)+1)","v":0}]
[]
["Type 1","Outlet Pressures @ Flow Rate, GPM",null,null,null,null,null,null,null,null,null,null,null,null,"Type 1","Inlet vs. Outlet Pressure Over Flow Range",null,null,null,null,null,null,"Type 1"]
["Inlet Pressure (psig)",0,50,100,150,175,200,250,300,350,400,450,500,null,null,null,"Static","50-200 [GPM]","200-300 [GPM]","300-400 [GPM]","400-500 [GPM]",null,null,null,{"$f":"CONCATENATE(\"Outlet Residual @ \" &AJ$8& \" GPM\")","v":"Outlet Residual @ 0 GPM"},{"$f":"CONCATENATE(\"Outlet Residual @ \" &AJ$9& \" GPM\")","v":"Outlet Residual @ 0 GPM"},null,null,"Const. PRI Interpolated @ Var. Flow"]
[50,38,32,31,27,23,21,12,null,null,null,null,null,null,"Inlet Pressure (psig)",{"$f":"A13","v":50},{"$f":"B13","v":38},{"$f":"AVERAGE(C13:G13)","v":26.8},{"$f":"AVERAGE(G13:I13)","v":16.5},null,null,null,"Inlet Pressure (psig)",{"$f":"A13","v":50},{"$f":"HLOOKUP($AJ$8,$B$12:$M$17,2)","v":38},{"$f":"HLOOKUP($AJ$9,$B$12:$M$17,2)","v":38},"PRI1:",{"$f":"LARGE(A13:A17,COUNTIF(A13:A17,\">\" &$AJ$6)+1)","v":{"$error":"#NUM!"}},{"$f":"VLOOKUP(AB13,X13:Z17,2)","v":{"$error":"#NUM!"}},{"$f":"VLOOKUP(AB13,X13:Z17,3)","v":{"$error":"#NUM!"}},"PRO1:",{"$f":"IF(AC13=AD13,AC13, FORECAST($AJ$7,AC13:AD13,$AJ$8:$AJ$9))","v":{"$error":"#NUM!"}}]
[100,72,66,65,62,60,56,48,36,24,null,null,null,null,null,{"$f":"A14","v":100},{"$f":"B14","v":72},{"$f":"AVERAGE(C14:G14)","v":61.8},{"$f":"AVERAGE(G14:I14)","v":46.666666666666664},{"$f":"AVERAGE(I14:K14)","v":30},null,null,null,{"$f":"A14","v":100},{"$f":"HLOOKUP($AJ$8,$B$12:$M$17,3)","v":72},{"$f":"HLOOKUP($AJ$9,$B$12:$M$17,3)","v":72},"PRI2:",{"$f":"SMALL(A13:A17,COUNTIF(A13:A17,\"<\"&$AJ$6)+1)","v":50},{"$f":"VLOOKUP(AB14,X13:Z17,2)","v":38},{"$f":"VLOOKUP(AB14,X13:Z17,3)","v":38},"PRO2:",{"$f":"IF(AC14=AD14, AC14, FORECAST($AJ$7,AC14:AD14,$AJ$8:$AJ$9))","v":38}]
[150,112,103,97,99,95,93,83,73,62,46,null,null,null,null,{"$f":"A15","v":150},112,{"$f":"AVERAGE(C15:G15)","v":97.4},83,60.333333333333336,{"$f":"AVERAGE(K15:M15)","v":46},null,null,{"$f":"A15","v":150},{"$f":"HLOOKUP($AJ$8,$B$12:$M$17,4)","v":112},{"$f":"HLOOKUP($AJ$9,$B$12:$M$17,4)","v":112},"PSI1:",{"$f":"LARGE(A13:A17,COUNTIF(A13:A17,\">\" &$AJ$5)+1)","v":{"$error":"#NUM!"}},null,null,"PSO1:",{"$f":"VLOOKUP(AB15,A13:B17,2)","v":{"$error":"#NUM!"}}]
{"$rows_left_out":61}
{"sheet":"1.5_Angle","index":5,"n_rows":54,"n_cols":35,"rows_kept":54,"cut":false,"hidden":true,"merged":[[10,1,10,12],[18,1,18,12],[27,1,27,12],[46,1,46,12],[2,1,2,12],[36,1,36,12],[12,14,16,14],[20,14,24,14],[29,14,33,14],[48,14,52,14],[2,15,2,18],[10,15,10,18],[18,15,18,18],[27,15,27,18],[46,15,46,18],[4,14,8,14],[36,15,36,18],[38,14,42,14],[3,26,3,27],[3,31,3,33],[4,20,8,20],[11,26,11,27],[12,20,16,20],[28,26,28,27],[47,26,47,27],[48,20,52,20],[19,26,19,27],[20,20,24,20],[29,20,33,20],[37,26,37,27],[38,20,42,20]]}
["1.5\" Angle Body - Outlet Pressures @ Flow Rate"]
[]
["Type 1","Outlet Pressures @ Flow Rate, GPM",null,null,null,null,null,null,null,null,null,null,null,null,"Type 1","Inlet vs. Outlet Pressure Over Flow Range",null,null,null,null,"Type 1"]
["Inlet Pressure (psig)",0,50,100,150,175,200,250,300,350,400,450,500,null,null,null,"Static","50-200 [GPM]","200-250 [GPM]",null,null,null,{"$f":"CONCATENATE(\"Outlet Residual @ \" &AH$8& \" GPM\")","v":"Outlet Residual @ 0 GPM"},{"$f":"CONCATENATE(\"Outlet Residual @ \" &AH$9& \" GPM\")","v":"Outlet Residual @ 0 GPM"},null,null,"Const. PRI Interpolated @ Var. Flow",null,null,null,null,"Variables:"]
[50,45,36,34,23,22,12,null,null,null,null,null,null,null,"Inlet Pressure (psig)",{"$f":"A5","v":50},{"$f":"B5","v":45},{"$f":"AVERAGE(C5:G5)","v":25.4},{"$f":"AVERAGE(G5:H5)","v":12},null,"Inlet Pressure (psig)",{"$f":"A5","v":50},{"$f":"HLOOKUP($AH$8,$B$4:$M$9,2)","v":45},{"$f":"HLOOKUP($AH$9,$B$4:$M$9,2)","v":45},"PRI1:",{"$f":"LARGE(A5:A9,COUNTIF(A5:A9,\">\" &$AH$6)+1)","v":{"$error":"#NUM!"}},{"$f":"VLOOKUP(Z5,V5:X9,2)","v":{"$error":"#NUM!"}},{"$f":"VLOOKUP(Z5,V5:X9,3)","v":{"$error":"#NUM!"}},"PRO1:",{"$f":"IF(AA5=AB5, AA5, FORECAST($AH$7,AA5:AB5,$AH$8:$AH$9))","v":{"$error":"#NUM!"}},null,"Static Inlet Pressure ","PSI:",{"$f":"Database!$B$2","v":0}]
[100,82,73,67,63,62,53,42,20,null,null,null,null,null,null,{"$f":"A6","v":100},{"$f":"B6","v":82},{"$f":"AVERAGE(C6:G6)","v":63.6},{"$f":"AVERAGE(G6:H6)","v":47.5},null,null,{"$f":"A6","v":100},{"$f":"HLOOKUP($AH$8,$B$4:$M$9,3)","v":82},{"$f":"HLOOKUP($AH$9,$B$4:$M$9,3)","v":82},"PRI2:",{"$f":"SMALL(A5:A9,COUNTIF(A5:A9,\"<\"&$AH$6)+1)","v":50},{"$f":"VLOOKUP(Z6,V5:X9,2)","v":45},{"$f":"VLOOKUP(Z6,V5:X9,3)","v":45},"PRO2:",{"$f":"IF(AA6=AB6, AA6, FORECAST($AH$7,AA6:AB6,$AH$8:$AH$9))","v":45},null,"Residual Inlet Pressure ","PRI:",{"$f":"Database!$B$3","v":0}]
[150,123,104,103,100,97,95,80,65,42,null,null,null,null,null,{"$f":"A7","v":150},123,99.8,87.5,null,null,150,{"$f":"HLOOKUP($AH$8,$B$4:$M$9,4)","v":123},{"$f":"HLOOKUP($AH$9,$B$4:$M$9,4)","v":123},"PSI1:",{"$f":"LARGE(A5:A9,COUNTIF(A5:A9,\">\" &$AH$5)+1)","v":{"$error":"#NUM!"}},null,null,"PSO1:",{"$f":"VLOOKUP(Z7,A5:B9,2)","v":{"$error":"#NUM!"}},null,"Flow Rate ","Q0:",{"$f":"Database!$B$4","v":0}]
[200,164,140,135,142,141,130,127,108,90,60,null,null,null,null,{"$f":"A8","v":200},164,137.6,128.5,null,null,200,{"$f":"HLOOKUP($AH$8,$B$4:$M$9,5)","v":164},{"$f":"HLOOKUP($AH$9,$B$4:$M$9,5)","v":164},"PSI2:",{"$f":"SMALL(A5:A9,COUNTIF(A5:A9,\"<\"&$AH$5)+1)","v":50},null,null,"PSO2:",{"$f":"VLOOKUP(Z8,A5:B9,2)","v":45},null,"Nearest Flow Rate, 1","Q1:",{"$f":"LARGE(B4:H4,COUNTIF(B4:H4,\">\" &$AH$7)+1)","v":0}]
[210,171,147,144,150,148,139,137,114,96,67,null,null,null,null,{"$f":"A9","v":210},171,145.6,138,null,null,210,{"$f":"HLOOKUP($AH$8,$B$4:$M$9,6)","v":171},{"$f":"HLOOKUP($AH$9,$B$4:$M$9,6)","v":171},null,null,null,null,null,null,null,"Nearest Known Flow Rate, 2","Q2:",{"$f":"SMALL(B4:H4,COUNTIF(B4:H4,\"<\"&$AH$7)+1)","v":0}]
[]
["Type 2","Outlet Pressures @ Flow Rate, GPM",null,null,null,null,null,null,null,null,null,null,null,null,"Type 2","Inlet vs. Outlet Pressure Over Flow Range",null,null,null,null,"Type 2"]
["Inlet Pressure (psig)",0,50,100,150,175,200,250,300,350,400,450,500,null,null,null,"Static","50-200 [GPM]","200-250 [GPM]",null,null,null,{"$f":"CONCATENATE(\"Outlet Residual @ \" &AH$8& \" GPM\")","v":"Outlet Residual @ 0 GPM"},{"$f":"CONCATENATE(\"Outlet Residual @ \" &AH$9& \" GPM\")","v":"Outlet Residual @ 0 GPM"},null,null,"Const. PRI Interpolated @ Var. Flow",null,null,null,null,"1.5\" Angle","Calculated Static Outlet Pressure","Calculated Residual Outlet Pressure","Max Flow Rate"]
[50,40,30,26,22,15,10,null,null,null,null,null,null,null,"Inlet Pressure (psig)",{"$f":"A13","v":50},{"$f":"B13","v":40},{"$f":"AVERAGE(C13:G13)","v":20.6},{"$f":"AVERAGE(G13:H13)","v":10},null,"Inlet Pressure (psig)",{"$f":"A13","v":50},{"$f":"HLOOKUP($AH$8,$B$12:$H$17,2)","v":40},{"$f":"HLOOKUP($AH$9,$B$12:$H$17,2)","v":40},"PRI1:",{"$f":"LARGE(A13:A17,COUNTIF(A13:A17,\">\" &$AH$6)+1)","v":{"$error":"#NUM!"}},{"$f":"VLOOKUP(Z13,V13:X17,2)","v":{"$error":"#NUM!"}},{"$f":"VLOOKUP(Z13,V13:X17,3)","v":{"$error":"#NUM!"}},"PRO1:",{"$f":"IF(AA13=AB13, AA13, FORECAST($AH$7,AA13:AB13,$AH$8:$AH$9))","v":{"$error":"#NUM!"}},null,"Type 1",{"$f":"IF(AD7=AD8,AD7,FORECAST(AH5,AD7:AD8,Z7:Z8))","v":{"$error":"#NUM!"}},{"$f":"IF(AD5=AD6,AD5,FORECAST($AH$6,AD5:AD6,Z5:Z6))","v":{"$error":"#NUM!"}},250]
[100,74,57,58,52,48,47,33,19,null,null,null,null,null,null,{"$f":"A14","v":100},{"$f":"B14","v":74},{"$f":"AVERAGE(C14:G14)","v":52.4},{"$f":"AVERAGE(G14:H14)","v":40},null,null,{"$f":"A14","v":100},{"$f":"HLOOKUP($AH$8,$B$12:$H$17,3)","v":74},{"$f":"HLOOKUP($AH$9,$B$12:$H$17,3)","v":74},"PRI2:",{"$f":"SMALL(A13:A17,COUNTIF(A13:A17,\"<\"&$AH$6)+1)","v":50},{"$f":"VLOOKUP(Z14,V13:X17,2)","v":40},{"$f":"VLOOKUP(Z14,V13:X17,3)","v":40},"PRO2:",{"$f":"IF(AA14=AB14, AA14, FORECAST($AH$7,AA14:AB14,$AH$8:$AH$9))","v":40},null,"Type 2",{"$f":"IF(AD15=AD16,AD15,FORECAST($AH$5,AD15:AD16,Z15:Z16))","v":{"$error":"#NUM!"}},{"$f":"IF(Z13=Z14,AD13,FORECAST($AH$6,AD13:AD14,Z13:Z14))","v":{"$error":"#NUM!"}},250]
[150,107,87,84,80,78,77,69,55,37,null,null,null,null,null,{"$f":"A15","v":150},107,81.2,73,null,null,150,{"$f":"HLOOKUP($AH$8,$B$12:$H$17,4)","v":107},{"$f":"HLOOKUP($AH$9,$B$12:$H$17,4)","v":107},"PSI1:",{"$f":"LARGE(A13:A17,COUNTIF(A13:A17,\">\" &$AH$5)+1)","v":{"$error":"#NUM!"}},null,null,"PSO1:",{"$f":"VLOOKUP(Z15,A13:B17,2)","v":{"$error":"#NUM!"}},null,"Type 3",{"$f":"IF(AD23=AD24,AD23,FORECAST($AH$5,AD23:AD24,Z23:Z24))","v":{"$error":"#NUM!"}},{"$f":"IF(Z21=Z22,AD21,FORECAST($AH$6,AD21:AD22,Z21:Z22))","v":{"$error":"#NUM!"}},250]
{"$rows_left_out":40}
{"sheet":"Flow_Charts","index":6,"n_rows":0,"n_cols":0,"rows_kept":0,"cut":false,"hidden":false,"merged":[]}